Jump to content

View more

Image of the Day

Project built to test Unity's networking
#gamedev #indiedev #screenshotsaturday #indiedevhour #madewithunity https://t.co/vcsky4QFKr
IOTD | Top Screenshots

The latest, straight to your Inbox.

Subscribe to GameDev.net Direct to receive the latest updates and exclusive content.


Sign up now

Compile errors

2: Adsense

Old topic!

Guest, the last post of this topic is over 60 days old and at this point you may not reply in this topic. If you wish to continue this conversation start a new topic.


  • You cannot reply to this topic
3 replies to this topic

#1 regonaros   Members   

115
Like
0Likes
Like

Posted 26 December 2012 - 08:51 PM

I just switched over to DirectX11 from DirectX9 and I've got the following compile errors when I ran my first DirectX program. any help appreciated.

 

1>------ Build started: Project: DirectX11, Configuration: Debug Win32 ------
1>Build started 26-Dec-12 18:37:20.
1>InitializeBuildStatus:
1>  Touching "Debug\DirectX11.unsuccessfulbuild".
1>ClCompile:
1>  All outputs are up-to-date.
1>ManifestResourceCompile:
1>  All outputs are up-to-date.
1>main.obj : error LNK2019: unresolved external symbol "bool __cdecl InitializeDirect3d11App(struct HINSTANCE__ *)" (?InitializeDirect3d11App@@YA_NPAUHINSTANCE__@@@Z) referenced in function _WinMain@16
1>c:\users\mike\documents\visual studio 2010\Projects\DirectX11\Debug\DirectX11.exe : fatal error LNK1120: 1 unresolved externals
1>
1>Build FAILED.
1>
1>Time Elapsed 00:00:00.19
========== Build: 0 succeeded, 1 failed, 0 up-to-date, 0 skipped ==========

 

 

thanks.



#2 smasherprog   Members   

568
Like
0Likes
Like

Posted 26 December 2012 - 08:58 PM

This just means that the function

bool InitializeDirect3d11App(HINSTANCE__ *)

that is used in your

_WinMain function is never defined anywhere

 

It is called, but the compiler cannot find the actual function definition.


Wisdom is knowing when to shut up, so try it.
--Game Development http://nolimitsdesigns.com: Reliable UDP library, Threading library, Math Library, UI Library. Take a look, its all free.

#3 L. Spiro   Members   

25308
Like
0Likes
Like

Posted 26 December 2012 - 08:59 PM

It is not a compile error it is a linker error.
Add the .CPP file containing that function to your project or, if you believe it already is then perform a full rebuild.

If the .CPP file is added and a full rebuild still fails, check the declaration of that function in its header file and ensure it is an exact match for its definition in the .CPP file (also assuming it exists in the .CPP at all).

 

 

L. Spiro



#4 regonaros   Members   

115
Like
0Likes
Like

Posted 26 December 2012 - 09:02 PM

Problem was in the naming of the function. Resolved.






Old topic!

Guest, the last post of this topic is over 60 days old and at this point you may not reply in this topic. If you wish to continue this conversation start a new topic.